[squid-users] Error compiling on OpenSuSE 11.3

From: Ricardo Rios <shorewall_at_malargue.gov.ar>
Date: Fri, 02 Dec 2011 21:05:44 -0300

I Compiled 3.1.15 and 3.1.16 so far without any problems, today i try to
compile the last version 3.1.17 and i got errors:

./configure CFLAGS=-DNUMTHREADS=128 --with-filedescriptors=16384
--enable-removal-policies=heap,lru --enable-epoll
--enable-stopreio=ufs,aufs,diskd --enable-async-io=128 --with-pthreads
--disable-dlmalloc --with-large-files --enable-large-cache-files
--with-aio --enable-esi --with-dl --enable-ltdl-convenience
--enable-linux-netfilter --disable-ident-lookups --enable-snmp --enable-htcp

ftp.o -MD -MP -MF $depbase.Tpo -c -o ftp.o ftp.cc &&\
mv -f $depbase.Tpo $depbase.Po
ftp.cc: In member function ‘void
FtpStateData::ftpAcceptDataConnection(const CommAcceptCbParams&)’:
ftp.cc:3124:38: error: redeclaration of ‘char ntoapeer [75]’
ftp.cc:3076:31: error: ‘char ntoapeer [75]’ previously declared here
make[3]: *** [ftp.o] Error 1
make[3]: se sale del directorio `/root/squid-3.1.17/src'
make[2]: *** [all-recursive] Error 1
make[2]: se sale del directorio `/root/squid-3.1.17/src'
make[1]: *** [all] Error 2
make[1]: se sale del directorio `/root/squid-3.1.17/src'
make: *** [all-recursive] Error 1

Received on Sat Dec 03 2011 - 00:04:14 MST

This archive was generated by hypermail 2.2.0 : Sat Dec 03 2011 - 12:00:02 MST